gradle run finished with non-zero exit value 1

Gradle - 1 is a just a general error code and the error is likely in the Gradle output; 2 seems To check your code for syntax errors and warnings, run verification > lint . 'android-studio/jre/bin/java' finished with non-zero exit value 2.

gradle compileSass BUILD FAILED .. finished with non-zero exit - I am not able to execute compileSass task. finished with non-zero exit value 1 * Try: Run with --info or --debug option to get more log output.

Process 'Gradle SpotBugs Worker 4' finished with non-zero exit - Execution failed for task ':Core:spotbugsMain'. Failed to run Gradle SpotBugs Worker. org.gradle.api.tasks.TaskExecutionException: Execution failed for task ':Core:spotbugsMain'.

Finished with non-zero exit value 1 - Help/Discuss - Hi guys, I just started learning gradle and I have a problem with gradle execute. Crash on: Process 'command 'C:\Program

Finished with non-zero exit value 1 error - Help/Discuss - FAILURE: Build failed with an exception. What went wrong: Execution failed for task ':run'.Process 'command 'C:\Program

Trouble setting up gradle - Help/Discuss - Execution failed for task ':run'. > Process 'command 'C:\Program Files\Java\jdk1. 8.0_162\bin\java.exe'' finished with non-zero exit value 1.

Why do I get this error 'Process 'command 'C:\Program Files\Java - A non zero exit value denotes an error during the process. Just open the console, re-run gradle build and check for the exception there.

Process 'command 'bash'' finished with non-zero exit value 1 - Process 'command 'bash'' finished with non-zero exit value 1. * Try: Run with -- info or --debug option to get more log output. * Exception is: org.gradle.api.tasks.

Gradle compiler daemon exits with non-zero exit code while running - Process 'Gradle Compiler Daemon 1' finished with non-zero exit value 137 https ://builds.apache.org/job/kafka-trunk-jdk8/702

Gradle Worker 1 finished with non-zero exit value - Gradle Worker 1 finished with non-zero exit value. Hi all, I have DefaultTaskExecuter.execute(DefaultTaskExecuter.java:43) 15:09:53.729

process 'command '/opt/android-studio/jre/bin/java'' finished with non-zero exit value 1

Process Synonyms, Process Antonyms - Synonyms for process at Thesaurus.com with free online thesaurus, antonyms, and definitions. Find descriptive alternatives for process.

Process - A process is a set of activities that interact to produce a result.

process - noun. 1A series of actions or steps taken in order to achieve a particular end. 'military operations could jeopardize the peace process' 'To think about the outcome will be to neglect the process needed to achieve the end result.'

What is process? definition and meaning - Definition: Sequence of interdependent and linked procedures which, at every stage, consume one or more resources Click to read more about process.

Process - Process definition, a systematic series of actions directed to some end: to devise a process for homogenizing milk. See more.

PROCESS - A process is also a method of doing or making something, as in industry: A new process has been developed for removing asbestos.

Process - Process definition is - progress, advance. How to use process in a sentence.

process (noun) definition and synonyms - Define process (noun) and get synonyms. What is process (noun)? process ( noun) meaning, pronunciation and more by Macmillan Dictionary.

Process - Define process. process synonyms, process pronunciation, process translation, English dictionary definition of process. n. pl. proc·ess·es 1. A series of actions,

process - process (plural processes). A series of events This product of last month's quality standards committee is quite good, even though the process was flawed.

error process finished with non zero exit value 2

android studio java finished with non-zero exit value 2 - I found the solution. I think Android Studio was using 2 java compilers, one built- in from android studio, and the other the one that I had installed in order to install

Error finished with non zero exit value 2 Android Studio on Ubuntu - “java finished with non-zero exit value 2”. This is a very general problem when we have used many libraries to build our android project.

Android Gradle Error "java finished with non-zero exit value 2 - ProcessException: org.gradle.process.internal. finished with non-zero exit value 2 #236 . Problem was that I was using old grade version.

finished with non-zero exit value 2 · Issue #236 · react-native - There is an error 'finished with non-zero exit value 2' when i was run on android environment. ProcessException: org.gradle.process.internal.

finished with non-zero exit value 2 · Issue #46 · react-native - 0. It's seems to you have not installed properly Oracle Java SDK 8? Please I was facing same problem. The steps to fixing the problem are:.

Gradle project refresh failed- Android Studio 2.2 - Error:Execution failed for task ':app:ndkBuild'. Process 'command finished with non-zero exit value 2 I can't find anything that says NDK.

Non zero exit value 2 Error In Android Studio - Help/Discuss - Fixed it by increasing and enabling mulitDex size on the gradle build.

marketing cloud - Finished with non-zero exit value 2 - A non zero exit value denotes an error during the process. Files\Java\jdk1.8.0 _45\bin\java.exe'' finished with non-zero exit 2 Answers.

Why do I get this error 'Process 'command 'C:\Program Files\Java - ProcessException: org.gradle.process.internal.ExecException: Found other threads that question this "exit value 2" error with no real answer.

AndroidStudio/NDK - finished with non-zero exit value2 - Error:Process 'command '/home/user/android-studio/jre/bin/java'' finished with non-zero

aapt.exe'' finished with non-zero exit value 1

What is the function of aapt.exe in android? - aapt.exe is the Android Asset Packaging Tool (aapt). It's designed to take your application resource files, such as the AndroidManifest.xml file

tools/windows/bin/aapt.exe - platform/prebuilts/sdk - android / platform / prebuilts / sdk / master / . / tools / windows / bin / aapt.exe. blob: bfe323ce1ab8e8cb20690f4e38e326584edc5710 [file] [log] [blame].

Cannot find aapt.exe - I have looked in my android folder, and now aapt.exe resides in. C:\Android\SDK\ build-tools\17.0.0\ This is a serious problem, as I am unable to

Can someone upload Android sdk's aapt.exe - I'm trying to to modify an apk from Ice Cream Sandwich, but the damn SDK Manager won't update aapt.exe to the Ice Cream Sandwich version

What is Aapt.exe and How to Fix It? Virus or Safe? - Aapt.exe problems include high CPU usage, application errors, and possible virus infection. Here are the top five most common Aapt.exe

Android Build-tools 21.0.1: "'aapt.exe' exited with code - The aapt binary from Android SDK Build-tools revision 21.0.1 has a bug on Windows that causes it to crash while building certain projects.

Unable to start application on this device: an unknown server-side - Original error packageAndLaunchActivityFromManyfest failed. Original error: Could not find aapt.exe.in … please help me because I really

Solved: Failed to find the Android SDK tool "\aapt.exe" - As usual, I solved the issue shortly after asking for help. Funny how that happens. .. Reinstalling TestComplete solved the issue.

Android build error: win 32 aapt.exe ? - A quick solution for this is co copy the aapt.exe file from build-tools and paste as shortcut on tools directory. Keep the shortcut name as aapt.exe.

build-tools\26.0.2\aapt.exe'' finished with non-zero exit - ProcessException: Error while executing process C:\Users\Hzx\AppData\Local\ Android\sdk1\build-tools\26.0.2\aapt.exe with arguments

23.0 3 aapt exe finished with non zero exit value 1

how to fix 23.0.1\aapt.exe'' finished with non-zero exit value 1 - in my case: I create new cordova project, then this aapt close in android studio, then i just update SDK Build Tools to 23.0.3 latest version. make

finished with non zero exit value - and finish the error is a way Could be 23.0.3 at the time of this post. . too long and aapt.exe stopped by returning 1 (and no specific error

Android\sdk\build-tools\23.0.1\aapt.exe'' finished with non-zero exit - \Android\sdk\build-tools\23.0.1\aapt.exe'' finished with non-zero exit value 1 #64 OS: Windows 10 node: v 4.4.7 npm: 3.10.3 phython: 2.7.1.3 c++: No resource found that matches the given name (at 'drawable' with value

How to Fix: aapt.exe'' finished with non-zero exit value 1 - Process 'command 'D:\android-studio-sdk\build-tools\27.0.3\aapt.exe'' finished with non-zero exit value 1. Posted by James 10 months ago. Hi, It is a new

How To Fix build-tools aapt.exe finished with non-zero exit value 1 - dylanvdm March 31, 2016, 5:25am #1 \Android\android-sdk\build-tools\23.0.3\ aapt.exe'' finished with non-zero exit value 1 BUILD FAILED Total time: 15.795

Process 'command 'D:\android-studio-sdk\build-tools\27.0.3\aapt.exe' - ExecException: Process 'command 'C:\Android\android-sdk\build-tools\23.0.3\ aapt.exe'' finished with non-zero exit value 1 " I have the

aapt.exe " finished with non-zero exit value 1 " error - build-tools\23.0.1\aapt.exe'' finished with non-zero exit value 1.